Reaction Details
TargetReverse transcriptase/RNaseH
LigandBDBM50169063
Substrate/Competitorn/a
Meas. Tech.ChEMBL_310375 (CHEMBL834370)
EC50 8000±n/a nM
Citation De Martino, GLa Regina, GDi Pasquali, ARagno, RBergamini, ACiaprini, CSinistro, AMaga, GCrespan, EArtico, MSilvestri, R Novel 1-[2-(diarylmethoxy)ethyl]-2-methyl-5-nitroimidazoles as HIV-1 non-nucleoside reverse transcriptase inhibitors. A structure-activity relationship investigation. J Med Chem48:4378-88 (2005) 
 
Reverse transcriptase/RNaseH
Name:Reverse transcriptase/RNaseH
Type:PROTEIN
Mol. Mass.:65229.15
Organism:Human immunodeficiency virus 1
Description:ChEMBL_1473730
Residue:566
BDBM50169063
NameBDBM50169063
Synonyms:Benzhydryl-[2-(2-methyl-5-nitro-imidazol-1-yl)-ethyl]-amine | CHEMBL190481
TypeSmall organic molecule
Emp. Form.C19H20N4O2
Mol. Mass.336.3877
SMILESCc1ncc(n1CCNC(c1ccccc1)c1ccccc1)[N+]([O-])=O