Reaction Details
TargetSolute carrier family 15 member 1
LigandBDBM50169136
Substrate/Competitorn/a
Meas. Tech.ChEMBL_302952 (CHEMBL841787)
Ki 390000±n/a nM
Citation Biegel, AGebauer, SHartrodt, BBrandsch, MNeubert, KThondorf, I Three-dimensional quantitative structure-activity relationship analyses of beta-lactam antibiotics and tripeptides as substrates of the mammalian H+/peptide cotransporter PEPT1. J Med Chem48:4410-9 (2005) 
 
Solute carrier family 15 member 1
Name:Solute carrier family 15 member 1
Type:PROTEIN
Mol. Mass.:78818.07
Organism:Homo sapiens (Human)
Description:ChEMBL_1488839
Residue:708
BDBM50169136
NameBDBM50169136
Synonyms:CHEMBL297722 [2-((S)-2-Amino-4-methyl-pentanoylamino)-acetylamino]-acetic acid | [2-(2-Amino-4-methyl-pentanoylamino)-acetylamino]-acetic acid
TypeSmall organic molecule
Emp. Form.C10H19N3O4
Mol. Mass.245.2756
SMILESCC(C)C[C@H](N)C(=O)NCC(=O)NCC(O)=O