Reaction Details
TargetSolute carrier family 15 member 1
LigandBDBM50169144
Substrate/Competitorn/a
Meas. Tech.ChEMBL_302952 (CHEMBL841787)
Ki 1400000±n/a nM
Citation Biegel, AGebauer, SHartrodt, BBrandsch, MNeubert, KThondorf, I Three-dimensional quantitative structure-activity relationship analyses of beta-lactam antibiotics and tripeptides as substrates of the mammalian H+/peptide cotransporter PEPT1. J Med Chem48:4410-9 (2005) 
 
Solute carrier family 15 member 1
Name:Solute carrier family 15 member 1
Type:PROTEIN
Mol. Mass.:78818.07
Organism:Homo sapiens (Human)
Description:ChEMBL_1488839
Residue:708
BDBM50169144
NameBDBM50169144
Synonyms:(S)-2-[(S)-2-Amino-3-(4-phenoxy-phenyl)-propionylamino]-propionic acid | CHEMBL190668
TypeSmall organic molecule
Emp. Form.C18H20N2O4
Mol. Mass.328.3624
SMILESC[C@H](NC(=O)[C@@H](N)Cc1ccc(Oc2ccccc2)cc1)C(O)=O