Reaction Details
TargetSolute carrier family 15 member 1
LigandBDBM50169156
Substrate/Competitorn/a
Meas. Tech.ChEMBL_302952 (CHEMBL841787)
Ki 970000±n/a nM
Citation Biegel, AGebauer, SHartrodt, BBrandsch, MNeubert, KThondorf, I Three-dimensional quantitative structure-activity relationship analyses of beta-lactam antibiotics and tripeptides as substrates of the mammalian H+/peptide cotransporter PEPT1. J Med Chem48:4410-9 (2005) 
 
Solute carrier family 15 member 1
Name:Solute carrier family 15 member 1
Type:PROTEIN
Mol. Mass.:78818.07
Organism:Homo sapiens (Human)
Description:ChEMBL_1488839
Residue:708
BDBM50169156
NameBDBM50169156
Synonyms:5-Amino-2-(2-amino-propionylamino)-pentanoic acid | CHEMBL190224
TypeSmall organic molecule
Emp. Form.C8H17N3O3
Mol. Mass.203.2389
SMILESC[C@H](N)C(=O)NC(CCCN)C(O)=O