Reaction Details
TargetSolute carrier family 15 member 1
LigandBDBM50169157
Substrate/Competitorn/a
Meas. Tech.ChEMBL_302952 (CHEMBL841787)
Ki 90000±n/a nM
Citation Biegel, AGebauer, SHartrodt, BBrandsch, MNeubert, KThondorf, I Three-dimensional quantitative structure-activity relationship analyses of beta-lactam antibiotics and tripeptides as substrates of the mammalian H+/peptide cotransporter PEPT1. J Med Chem48:4410-9 (2005) 
 
Solute carrier family 15 member 1
Name:Solute carrier family 15 member 1
Type:PROTEIN
Mol. Mass.:78818.07
Organism:Homo sapiens (Human)
Description:ChEMBL_1488839
Residue:708
BDBM50169157
NameBDBM50169157
Synonyms:(S)-2-[(S)-2-Amino-3-(4-benzyloxy-phenyl)-propionylamino]-propionic acid | CHEMBL190728
TypeSmall organic molecule
Emp. Form.C19H22N2O4
Mol. Mass.342.389
SMILESC[C@H](NC(=O)[C@@H](N)Cc1ccc(OCc2ccccc2)cc1)C(O)=O