Reaction Details
TargetSolute carrier family 15 member 1
LigandBDBM50169173
Substrate/Competitorn/a
Meas. Tech.ChEMBL_302952 (CHEMBL841787)
Ki 510000±n/a nM
Citation Biegel, AGebauer, SHartrodt, BBrandsch, MNeubert, KThondorf, I Three-dimensional quantitative structure-activity relationship analyses of beta-lactam antibiotics and tripeptides as substrates of the mammalian H+/peptide cotransporter PEPT1. J Med Chem48:4410-9 (2005) 
 
Solute carrier family 15 member 1
Name:Solute carrier family 15 member 1
Type:PROTEIN
Mol. Mass.:78818.07
Organism:Homo sapiens (Human)
Description:ChEMBL_1488839
Residue:708
BDBM50169173
NameBDBM50169173
Synonyms:(S)-6-Amino-2-((S)-2-amino-4-carboxy-butyrylamino)-hexanoic acid Glu-Lys
TypeSmall organic molecule
Emp. Form.C11H21N3O5
Mol. Mass.275.3015
SMILESNCCCC[C@H](NC(=O)[C@@H](N)CCC(O)=O)C(O)=O