Reaction Details
TargetSolute carrier family 15 member 1
LigandBDBM50169179
Substrate/Competitorn/a
Meas. Tech.ChEMBL_302952 (CHEMBL841787)
Ki 1500000±n/a nM
Citation Biegel, AGebauer, SHartrodt, BBrandsch, MNeubert, KThondorf, I Three-dimensional quantitative structure-activity relationship analyses of beta-lactam antibiotics and tripeptides as substrates of the mammalian H+/peptide cotransporter PEPT1. J Med Chem48:4410-9 (2005) 
 
Solute carrier family 15 member 1
Name:Solute carrier family 15 member 1
Type:PROTEIN
Mol. Mass.:78818.07
Organism:Homo sapiens (Human)
Description:ChEMBL_1488839
Residue:708
BDBM50169179
NameBDBM50169179
Synonyms:CHEMBL190085 | Cyclohexanecarboxylic acid ((S)-2-amino-propionyl)-amide
TypeSmall organic molecule
Emp. Form.C10H18N2O2
Mol. Mass.198.2621
SMILESC[C@H](N)C(=O)NC(=O)C1CCCCC1