Reaction Details
TargetSolute carrier family 15 member 1
LigandBDBM50370591
Substrate/Competitorn/a
Meas. Tech.ChEMBL_302952 (CHEMBL841787)
Ki>30000000±n/a nM
Citation Biegel, AGebauer, SHartrodt, BBrandsch, MNeubert, KThondorf, I Three-dimensional quantitative structure-activity relationship analyses of beta-lactam antibiotics and tripeptides as substrates of the mammalian H+/peptide cotransporter PEPT1. J Med Chem48:4410-9 (2005) 
 
Solute carrier family 15 member 1
Name:Solute carrier family 15 member 1
Type:PROTEIN
Mol. Mass.:78818.07
Organism:Homo sapiens (Human)
Description:ChEMBL_1488839
Residue:708
BDBM50370591
NameBDBM50370591
Synonyms:CEFPIROME | Cefrom
TypeSmall organic molecule
Emp. Form.C22H22N6O5S2
Mol. Mass.514.577
SMILESCO\N=C(/C(=O)N[C@@H]1[C@H]2SCC(C[n+]3cccc4CCCc34)=C(N2C1=O)C([O-])=O)c1csc(N)n1