Reaction Details
TargetSolute carrier family 15 member 1
LigandBDBM50169195
Substrate/Competitorn/a
Meas. Tech.ChEMBL_302952 (CHEMBL841787)
Ki 9800000±n/a nM
Citation Biegel, AGebauer, SHartrodt, BBrandsch, MNeubert, KThondorf, I Three-dimensional quantitative structure-activity relationship analyses of beta-lactam antibiotics and tripeptides as substrates of the mammalian H+/peptide cotransporter PEPT1. J Med Chem48:4410-9 (2005) 
 
Solute carrier family 15 member 1
Name:Solute carrier family 15 member 1
Type:PROTEIN
Mol. Mass.:78818.07
Organism:Homo sapiens (Human)
Description:ChEMBL_1488839
Residue:708
BDBM50169195
NameBDBM50169195
Synonyms:(S)-2-[((S)-Pyrrolidine-2-carbonyl)-amino]-succinic acid Pro-Asp
TypeSmall organic molecule
Emp. Form.C9H14N2O5
Mol. Mass.230.2179
SMILESOC(=O)C[C@H](NC(=O)[C@@H]1CCCN1)C(O)=O