Reaction Details
TargetSolute carrier family 15 member 1
LigandBDBM50169224
Substrate/Competitorn/a
Meas. Tech.ChEMBL_302952 (CHEMBL841787)
Ki 7900000±n/a nM
Citation Biegel, AGebauer, SHartrodt, BBrandsch, MNeubert, KThondorf, I Three-dimensional quantitative structure-activity relationship analyses of beta-lactam antibiotics and tripeptides as substrates of the mammalian H+/peptide cotransporter PEPT1. J Med Chem48:4410-9 (2005) 
 
Solute carrier family 15 member 1
Name:Solute carrier family 15 member 1
Type:PROTEIN
Mol. Mass.:78818.07
Organism:Homo sapiens (Human)
Description:ChEMBL_1488839
Residue:708
BDBM50169224
NameBDBM50169224
Synonyms:(S)-2-[(S)-2-(2-Amino-propionylamino)-propionylamino]-propionic acid | CHEMBL364278
TypeSmall organic molecule
Emp. Form.C9H17N3O5
Mol. Mass.247.2484
SMILESC[C@@H](N)C(=O)ON[C@@H](C)C(=O)N[C@@H](C)C(O)=O