Reaction Details
TargetRibosomal protein S6 kinase beta-1/beta-2
LigandBDBM50169959
Substrate/Competitorn/a
Meas. Tech.ChEMBL_304657 (CHEMBL877306)
IC50>10000±n/a nM
Citation Gaillard, PJeanclaude-Etter, IArdissone, VArkinstall, SCambet, YCamps, MChabert, CChurch, DCirillo, RGretener, DHalazy, SNichols, ASzyndralewiez, CVitte, PAGotteland, JP Design and synthesis of the first generation of novel potent, selective, and in vivo active (benzothiazol-2-yl)acetonitrile inhibitors of the c-Jun N-terminal kinase. J Med Chem48:4596-607 (2005) 
 
Ribosomal protein S6 kinase beta-1/beta-2
Name:Ribosomal protein S6 kinase beta-1/beta-2
Type:n/a
Mol. Mass.:n/a
Description:ASSAY_ID of EBI is 195569
Components:This complex has 2 components.
Component 1
Name:Ribosomal protein S6 kinase beta-1
Synonyms:70 kDa ribosomal protein S6 kinase 1 70 kDa ribosomal protein kinase (p70S6K) Protein kinase 70S6K (T412E) RPS6KB1 Ribosomal protein S6 kinase I STK14A p70S6K1
Type:Enzyme
Mol. Mass.:59139.89
Organism:Homo sapiens (Human)
Description:His-tagged S6K1.
Residue:525
Component 2
Name:Ribosomal protein S6 kinase beta-2
Synonyms:KS6B2_HUMAN Ribosomal protein S6 kinase (P70S6K) | STK14B
Type:PROTEIN
Mol. Mass.:53460.10
Organism:Homo sapiens (Human)
Description:ChEMBL_306115
Residue:482
Component 3
Name:Ribosomal protein S6 kinase beta-2
Synonyms:KS6B2_HUMAN Ribosomal protein S6 kinase (P70S6K) | STK14B
Type:PROTEIN
Mol. Mass.:53460.10
Organism:Homo sapiens (Human)
Description:ChEMBL_306115
Residue:482
BDBM50169959
NameBDBM50169959
Synonyms:2-(benzo[d]thiazol-2(3H)-ylidene)-2-(2-(2-(pyridin-3-yl)ethylamino)pyrimidin-4-yl)acetonitrile AS601245 CHEMBL191384 | [3H-Benzothiazol-(2Z)-ylidene]-[2-(2-pyridin-3-yl-ethylamino)-pyrimidin-4-yl]-acetonitrile
TypeSmall organic molecule
Emp. Form.C20H16N6S
Mol. Mass.372.446
SMILESN#CC(c1nc2ccccc2s1)c1ccnc(NCCc2cccnc2)n1