Reaction Details
TargetMAP kinase-activated protein kinase 5
LigandBDBM50169959
Substrate/Competitorn/a
Meas. Tech.ChEMBL_304859 (CHEMBL828417)
IC50>10000±n/a nM
Citation Gaillard, PJeanclaude-Etter, IArdissone, VArkinstall, SCambet, YCamps, MChabert, CChurch, DCirillo, RGretener, DHalazy, SNichols, ASzyndralewiez, CVitte, PAGotteland, JP Design and synthesis of the first generation of novel potent, selective, and in vivo active (benzothiazol-2-yl)acetonitrile inhibitors of the c-Jun N-terminal kinase. J Med Chem48:4596-607 (2005) 
 
MAP kinase-activated protein kinase 5
Name:MAP kinase-activated protein kinase 5
Type:Serine/threonine-protein kinase
Mol. Mass.:54229.92
Organism:Homo sapiens (Human)
Description:Recombinant MAPKAPK5 was phosphorylated by incubation with active p38alpha before assays.
Residue:473
BDBM50169959
NameBDBM50169959
Synonyms:2-(benzo[d]thiazol-2(3H)-ylidene)-2-(2-(2-(pyridin-3-yl)ethylamino)pyrimidin-4-yl)acetonitrile AS601245 CHEMBL191384 | [3H-Benzothiazol-(2Z)-ylidene]-[2-(2-pyridin-3-yl-ethylamino)-pyrimidin-4-yl]-acetonitrile
TypeSmall organic molecule
Emp. Form.C20H16N6S
Mol. Mass.372.446
SMILESN#CC(c1nc2ccccc2s1)c1ccnc(NCCc2cccnc2)n1