Reaction Details
TargetMitogen-activated protein kinase 10
LigandBDBM50169999
Substrate/Competitorn/a
Meas. Tech.ChEMBL_304976 (CHEMBL829309)
IC50 143±n/a nM
Citation Gaillard, PJeanclaude-Etter, IArdissone, VArkinstall, SCambet, YCamps, MChabert, CChurch, DCirillo, RGretener, DHalazy, SNichols, ASzyndralewiez, CVitte, PAGotteland, JP Design and synthesis of the first generation of novel potent, selective, and in vivo active (benzothiazol-2-yl)acetonitrile inhibitors of the c-Jun N-terminal kinase. J Med Chem48:4596-607 (2005) 
 
Mitogen-activated protein kinase 10
Name:Mitogen-activated protein kinase 10
Type:PROTEIN
Mol. Mass.:52534.34
Organism:Rattus norvegicus
Description:ChEMBL_1460661
Residue:464
BDBM50169999
NameBDBM50169999
Synonyms:CHEMBL371113 | [3H-Benzothiazol-(2Z)-ylidene]-{2-[2-(3-methyl-3H-imidazol-4-yl)-ethylamino]-pyrimidin-4-yl}-acetonitrile
TypeSmall organic molecule
Emp. Form.C19H17N7S
Mol. Mass.375.45
SMILESCn1cncc1CCNc1nccc(n1)C(C#N)c1nc2ccccc2s1