Reaction Details
TargetMitogen-activated protein kinase 10
LigandBDBM50170009
Substrate/Competitorn/a
Meas. Tech.ChEMBL_304976 (CHEMBL829309)
IC50 3500±n/a nM
Citation Gaillard, PJeanclaude-Etter, IArdissone, VArkinstall, SCambet, YCamps, MChabert, CChurch, DCirillo, RGretener, DHalazy, SNichols, ASzyndralewiez, CVitte, PAGotteland, JP Design and synthesis of the first generation of novel potent, selective, and in vivo active (benzothiazol-2-yl)acetonitrile inhibitors of the c-Jun N-terminal kinase. J Med Chem48:4596-607 (2005) 
 
Mitogen-activated protein kinase 10
Name:Mitogen-activated protein kinase 10
Type:PROTEIN
Mol. Mass.:52534.34
Organism:Rattus norvegicus
Description:ChEMBL_1460661
Residue:464
BDBM50170009
NameBDBM50170009
Synonyms:CHEMBL373086 | [3H-Benzothiazol-(2Z)-ylidene]-{2-[2-(4-hydroxy-phenyl)-ethylamino]-pyrimidin-4-yl}-acetonitrile
TypeSmall organic molecule
Emp. Form.C21H17N5OS
Mol. Mass.387.458
SMILESOc1ccc(CCNc2nccc(n2)C(C#N)c2nc3ccccc3s2)cc1