Reaction Details
TargetMitogen-activated protein kinase 10
LigandBDBM50170008
Substrate/Competitorn/a
Meas. Tech.ChEMBL_304976 (CHEMBL829309)
IC50 80±n/a nM
Citation Gaillard, PJeanclaude-Etter, IArdissone, VArkinstall, SCambet, YCamps, MChabert, CChurch, DCirillo, RGretener, DHalazy, SNichols, ASzyndralewiez, CVitte, PAGotteland, JP Design and synthesis of the first generation of novel potent, selective, and in vivo active (benzothiazol-2-yl)acetonitrile inhibitors of the c-Jun N-terminal kinase. J Med Chem48:4596-607 (2005) 
 
Mitogen-activated protein kinase 10
Name:Mitogen-activated protein kinase 10
Type:PROTEIN
Mol. Mass.:52534.34
Organism:Rattus norvegicus
Description:ChEMBL_1460661
Residue:464
BDBM50170008
NameBDBM50170008
Synonyms:CHEMBL372708 | {2-[2-(4-Amino-phenyl)-ethylamino]-pyrimidin-4-yl}-[3H-benzothiazol-(2Z)-ylidene]-acetonitrile
TypeSmall organic molecule
Emp. Form.C21H18N6S
Mol. Mass.386.473
SMILESNc1ccc(CCNc2nccc(n2)C(C#N)c2nc3ccccc3s2)cc1