Reaction Details
TargetS-methyl-5'-thioadenosine phosphorylase
LigandBDBM50170091
Substrate/Competitorn/a
Meas. Tech.ChEMBL_303908 (CHEMBL828333)
Ki 0.16±n/a nM
Citation Evans, GBFurneaux, RHLenz, DHPainter, GFSchramm, VLSingh, VTyler, PC Second generation transition state analogue inhibitors of human 5'-methylthioadenosine phosphorylase. J Med Chem48:4679-89 (2005) 
 
S-methyl-5'-thioadenosine phosphorylase
Name:S-methyl-5'-thioadenosine phosphorylase
Type:Enzyme
Mol. Mass.:31239.23
Organism:Homo sapiens (Human)
Description:n/a
Residue:283
BDBM50170091
NameBDBM50170091
Synonyms:1-(4-Amino-4,5-dihydro-3H-pyrrolo[3,2-d]pyrimidin-7-ylmethyl)-4-(pyridin-4-ylsulfanylmethyl)-pyrrolidin-3-ol | CHEMBL190139
TypeSmall organic molecule
Emp. Form.C17H22N6OS
Mol. Mass.358.461
SMILESNC1NC=Nc2c(CN3CC(O)C(CSc4ccncc4)C3)c[nH]c12