Reaction Details
TargetNeuronal acetylcholine receptor subunit alpha-7
LigandBDBM80642
Substrate/Competitorn/a
Meas. Tech.ChEMBL_305504 (CHEMBL831106)
IC50 110±n/a nM
Citation Jensen, AAFrølund, BLiljefors, TKrogsgaard-Larsen, P Neuronal nicotinic acetylcholine receptors: structural revelations, target identifications, and therapeutic inspirations. J Med Chem48:4705-45 (2005) 
 
Neuronal acetylcholine receptor subunit alpha-7
Name:Neuronal acetylcholine receptor subunit alpha-7
Type:n/a
Mol. Mass.:56448.33
Organism:Homo sapiens (Human)
Description: CHRNA7 (NACHRA7)
Residue:502
BDBM80642
NameBDBM80642
Synonyms:CHEMBL191491 MLS002172460 cid_6433339 triethyl-[2-[4-[(E)-2-phenylethenyl]phenoxy]ethyl]azanium;iodide | triethyl-[2-[4-[(E)-styryl]phenoxy]ethyl]ammonium;iodide
TypeSmall organic molecule
Emp. Form.C22H30NO
Mol. Mass.324.4792
SMILESCC[N+](CC)(CC)CCOc1ccc(\C=C\c2ccccc2)cc1