Reaction Details
TargetNeuronal acetylcholine receptor subunit alpha-7
LigandBDBM50369323
Substrate/Competitorn/a
Meas. Tech.ChEMBL_305504 (CHEMBL831106)
IC50 12300±n/a nM
Citation Jensen, AAFrølund, BLiljefors, TKrogsgaard-Larsen, P Neuronal nicotinic acetylcholine receptors: structural revelations, target identifications, and therapeutic inspirations. J Med Chem48:4705-45 (2005) 
 
Neuronal acetylcholine receptor subunit alpha-7
Name:Neuronal acetylcholine receptor subunit alpha-7
Type:n/a
Mol. Mass.:56448.33
Organism:Homo sapiens (Human)
Description: CHRNA7 (NACHRA7)
Residue:502
BDBM50369323
NameBDBM50369323
Synonyms:MECAMYLAMINE
TypeSmall organic molecule
Emp. Form.C11H21N
Mol. Mass.167.2911
SMILESCN[C@]1(C)[C@@H]2CC[C@@H](C2)C1(C)C