Reaction Details
TargetC-8 sterol isomerase ERG2
LigandBDBM50170647
Substrate/Competitorn/a
Meas. Tech.ChEMBL_303390 (CHEMBL839961)
Ki 310±n/a nM
Citation Laggner, CSchieferer, CFiechtner, BPoles, GHoffmann, RDGlossmann, HLanger, TMoebius, FF Discovery of high-affinity ligands of sigma1 receptor, ERG2, and emopamil binding protein by pharmacophore modeling and virtual screening. J Med Chem48:4754-64 (2005) 
 
C-8 sterol isomerase ERG2
Name:C-8 sterol isomerase ERG2
Type:PROTEIN
Mol. Mass.:24892.29
Organism:Saccharomyces cerevisiae
Description:ChEMBL_303390
Residue:222
BDBM50170647
NameBDBM50170647
Synonyms:CHEMBL626 Methyl-naphthalen-1-ylmethyl-(3-phenyl-allyl)-amine Naftin
TypeSmall organic molecule
Emp. Form.C21H21N
Mol. Mass.287.3981
SMILESCN(C\C=C\c1ccccc1)Cc1cccc2ccccc12