Reaction Details
TargetC-8 sterol isomerase ERG2
LigandBDBM50010618
Substrate/Competitorn/a
Meas. Tech.ChEMBL_303390 (CHEMBL839961)
Ki 1200±n/a nM
Citation Laggner, CSchieferer, CFiechtner, BPoles, GHoffmann, RDGlossmann, HLanger, TMoebius, FF Discovery of high-affinity ligands of sigma1 receptor, ERG2, and emopamil binding protein by pharmacophore modeling and virtual screening. J Med Chem48:4754-64 (2005) 
 
C-8 sterol isomerase ERG2
Name:C-8 sterol isomerase ERG2
Type:PROTEIN
Mol. Mass.:24892.29
Organism:Saccharomyces cerevisiae
Description:ChEMBL_303390
Residue:222
BDBM50010618
NameBDBM50010618
Synonyms:(+)-3-(1-Propyl-piperidin-3-yl)-phenol 3-(1-Propyl-piperidin-3-yl)-phenol CHEMBL7393 | cid_202478
TypeSmall organic molecule
Emp. Form.C14H21NO
Mol. Mass.219.3226
SMILESCCCN1CCC[C@@H](C1)c1cccc(O)c1