Reaction Details
Target3-beta-hydroxysteroid-Delta(8),Delta(7)-isomerase
LigandBDBM50170650
Substrate/Competitorn/a
Meas. Tech.ChEMBL_303691 (CHEMBL829736)
Ki 4±n/a nM
Citation Laggner, CSchieferer, CFiechtner, BPoles, GHoffmann, RDGlossmann, HLanger, TMoebius, FF Discovery of high-affinity ligands of sigma1 receptor, ERG2, and emopamil binding protein by pharmacophore modeling and virtual screening. J Med Chem48:4754-64 (2005) 
 
3-beta-hydroxysteroid-Delta(8),Delta(7)-isomerase
Name:3-beta-hydroxysteroid-Delta(8),Delta(7)-isomerase
Type:PROTEIN
Mol. Mass.:26358.51
Organism:Homo sapiens (Human)
Description:ChEMBL_873432
Residue:230
BDBM50170650
NameBDBM50170650
Synonyms:(2-{4-[(2-Chloro-benzylamino)-methyl]-cyclohexyl}-ethyl)-(2-chloro-phenyl)-amine | CHEMBL361085
TypeSmall organic molecule
Emp. Form.C22H28Cl2N2
Mol. Mass.391.377
SMILESClc1ccccc1CNC[C@H]1CC[C@H](CCNc2ccccc2Cl)CC1