Reaction Details
TargetSigma non-opioid intracellular receptor 1
LigandBDBM50170650
Substrate/Competitorn/a
Meas. Tech.ChEMBL_303441 (CHEMBL839610)
Ki 0.50±n/a nM
Citation Laggner, CSchieferer, CFiechtner, BPoles, GHoffmann, RDGlossmann, HLanger, TMoebius, FF Discovery of high-affinity ligands of sigma1 receptor, ERG2, and emopamil binding protein by pharmacophore modeling and virtual screening. J Med Chem48:4754-64 (2005) 
 
Sigma non-opioid intracellular receptor 1
Name:Sigma non-opioid intracellular receptor 1
Type:Enzyme Catalytic Domain
Mol. Mass.:25124.85
Organism:Homo sapiens (Human)
Description:Q99720
Residue:223
BDBM50170650
NameBDBM50170650
Synonyms:(2-{4-[(2-Chloro-benzylamino)-methyl]-cyclohexyl}-ethyl)-(2-chloro-phenyl)-amine | CHEMBL361085
TypeSmall organic molecule
Emp. Form.C22H28Cl2N2
Mol. Mass.391.377
SMILESClc1ccccc1CNC[C@H]1CC[C@H](CCNc2ccccc2Cl)CC1