Reaction Details
TargetSigma non-opioid intracellular receptor 1
LigandBDBM50170659
Substrate/Competitorn/a
Meas. Tech.ChEMBL_303441 (CHEMBL839610)
Ki 1±n/a nM
Citation Laggner, CSchieferer, CFiechtner, BPoles, GHoffmann, RDGlossmann, HLanger, TMoebius, FF Discovery of high-affinity ligands of sigma1 receptor, ERG2, and emopamil binding protein by pharmacophore modeling and virtual screening. J Med Chem48:4754-64 (2005) 
 
Sigma non-opioid intracellular receptor 1
Name:Sigma non-opioid intracellular receptor 1
Type:Enzyme Catalytic Domain
Mol. Mass.:25124.85
Organism:Homo sapiens (Human)
Description:Q99720
Residue:223
BDBM50170659
NameBDBM50170659
Synonyms:2-[3-(Methyl-phenethyl-amino)-propyl]-2-phenyl-tetradecanenitrile Ronipamil
TypeSmall organic molecule
Emp. Form.C32H48N2
Mol. Mass.460.7369
SMILESCCCCCCCCCCCCC(CCCN(C)CCc1ccccc1)(C#N)c1ccccc1