Reaction Details
TargetC-8 sterol isomerase ERG2
LigandBDBM50065941
Substrate/Competitorn/a
Meas. Tech.ChEMBL_303390 (CHEMBL839961)
Ki 232±n/a nM
Citation Laggner, CSchieferer, CFiechtner, BPoles, GHoffmann, RDGlossmann, HLanger, TMoebius, FF Discovery of high-affinity ligands of sigma1 receptor, ERG2, and emopamil binding protein by pharmacophore modeling and virtual screening. J Med Chem48:4754-64 (2005) 
 
C-8 sterol isomerase ERG2
Name:C-8 sterol isomerase ERG2
Type:PROTEIN
Mol. Mass.:24892.29
Organism:Saccharomyces cerevisiae
Description:ChEMBL_303390
Residue:222
BDBM50065941
NameBDBM50065941
Synonyms:1-{2-[4-(6-Methoxy-2-phenyl-3,4-dihydro-naphthalen-1-yl)-phenoxy]-ethyl}-pyrrolidine | CHEMBL28211
TypeSmall organic molecule
Emp. Form.C29H31NO2
Mol. Mass.425.5619
SMILESCOc1ccc2C(=C(CCc2c1)c1ccccc1)c1ccc(OCCN2CCCC2)cc1