Reaction Details
TargetC-8 sterol isomerase ERG2
LigandBDBM50170661
Substrate/Competitorn/a
Meas. Tech.ChEMBL_303390 (CHEMBL839961)
Ki 74±n/a nM
Citation Laggner, CSchieferer, CFiechtner, BPoles, GHoffmann, RDGlossmann, HLanger, TMoebius, FF Discovery of high-affinity ligands of sigma1 receptor, ERG2, and emopamil binding protein by pharmacophore modeling and virtual screening. J Med Chem48:4754-64 (2005) 
 
C-8 sterol isomerase ERG2
Name:C-8 sterol isomerase ERG2
Type:PROTEIN
Mol. Mass.:24892.29
Organism:Saccharomyces cerevisiae
Description:ChEMBL_303390
Residue:222
BDBM50170661
NameBDBM50170661
Synonyms:(S)-2-Isopropyl-5-(methyl-phenethyl-amino)-2-phenyl-pentanenitrile Levemopamil
TypeSmall organic molecule
Emp. Form.C23H30N2
Mol. Mass.334.4977
SMILESCC(C)[C@](CCCN(C)CCc1ccccc1)(C#N)c1ccccc1