Reaction Details
TargetCannabinoid receptor 1/2
LigandBDBM50069269
Substrate/Competitorn/a
Meas. Tech.ChEMBL_302384 (CHEMBL830351)
Ki 800±n/a nM
Citation Lambert, DMFowler, CJ The endocannabinoid system: drug targets, lead compounds, and potential therapeutic applications. J Med Chem48:5059-87 (2005) 
 
Cannabinoid receptor 1/2
Name:Cannabinoid receptor 1/2
Synonyms:Cannabinoid receptor
Type:n/a
Mol. Mass.:n/a
Description:ASSAY_ID of ChEMBL is 302384
Components:This complex has 2 components.
Component 1
Name:Cannabinoid receptor 2
Type:G Protein-Coupled Receptor (GPCR)
Mol. Mass.:39690.94
Organism:Homo sapiens (Human)
Description:P34972
Residue:360
Component 2
Name:Cannabinoid receptor 1
Synonyms:CANN6 CB-R CNR CNR1_HUMAN Cannabinoid receptor Cannabinoid receptor 1 (brain)
Type:G Protein-Coupled Receptor (GPCR)
Mol. Mass.:52868.96
Organism:Homo sapiens (Human)
Description:P21554
Residue:472
BDBM50069269
NameBDBM50069269
Synonyms:(R)-octan-2-yl 4-bromo-3-oxobutanoate CHEMBL347894
TypeSmall organic molecule
Emp. Form.C12H21BrO3
Mol. Mass.293.197
SMILESCCCCCC[C@@H](C)OC(=O)CC(=O)CBr