Reaction Details
TargetFatty-acid amide hydrolase 1
LigandBDBM50058046
Substrate/Competitorn/a
Meas. Tech.ChEBML_306356
IC50 52000±n/a nM
Citation Lambert, DMFowler, CJ The endocannabinoid system: drug targets, lead compounds, and potential therapeutic applications. J Med Chem48:5059-87 (2005) 
 
Fatty-acid amide hydrolase 1
Name:Fatty-acid amide hydrolase 1
Type:Protein
Mol. Mass.:63071.19
Organism:Homo sapiens (Human)
Description:O00519
Residue:579
BDBM50058046
NameBDBM50058046
Synonyms:CHEMBL526 | propofol
TypeSmall organic molecule
Emp. Form.C12H18O
Mol. Mass.178.2707
SMILESCC(C)c1cccc(C(C)C)c1O