Reaction Details
TargetFatty-acid amide hydrolase 1
LigandBDBM50128913
Substrate/Competitorn/a
Meas. Tech.ChEBML_306356
IC50>25000±n/a nM
Citation Lambert, DMFowler, CJ The endocannabinoid system: drug targets, lead compounds, and potential therapeutic applications. J Med Chem48:5059-87 (2005) 
 
Fatty-acid amide hydrolase 1
Name:Fatty-acid amide hydrolase 1
Type:Protein
Mol. Mass.:63071.19
Organism:Homo sapiens (Human)
Description:O00519
Residue:579
BDBM50128913
NameBDBM50128913
Synonyms:(5Z,8Z,11Z)-Icosa-5,8,11,14-tetraenoic acid 2-hydroxy-ethyl ester CHEMBL58624
TypeSmall organic molecule
Emp. Form.C22H36O3
Mol. Mass.348.5194
SMILESCCCCC\C=C/C\C=C/C\C=C/C\C=C/CCCC(=O)OCCO