Reaction Details
TargetCannabinoid receptor 1
LigandBDBM50056457
Substrate/Competitorn/a
Meas. Tech.ChEBML_302977
Ki 53±n/a nM
Citation Lambert, DMFowler, CJ The endocannabinoid system: drug targets, lead compounds, and potential therapeutic applications. J Med Chem48:5059-87 (2005) 
 
Cannabinoid receptor 1
Name:Cannabinoid receptor 1
Type:G Protein-Coupled Receptor (GPCR)
Mol. Mass.:52856.55
Organism:Rattus norvegicus (rat)
Description:P20272
Residue:473
BDBM50056457
NameBDBM50056457
Synonyms:(8Z,11Z,14Z)-N-(2-hydroxyethyl)icosa-8,11,14-trienamide 8,11,14-Eicosatrienoylethanolamide CHEMBL121229 Homo-gamma-linolenylethanolamide | N-(8Z,11Z,14Z-icosatrienoyl)-ethanolamide
TypeSmall organic molecule
Emp. Form.C22H39NO2
Mol. Mass.349.5506
SMILESCCCCC\C=C/C\C=C/C\C=C/CCCCCCC(=O)NCCO