Reaction Details
TargetFatty-acid amide hydrolase 1
LigandBDBM50096882
Substrate/Competitorn/a
Meas. Tech.ChEBML_306356
IC50 19000±n/a nM
Citation Lambert, DMFowler, CJ The endocannabinoid system: drug targets, lead compounds, and potential therapeutic applications. J Med Chem48:5059-87 (2005) 
 
Fatty-acid amide hydrolase 1
Name:Fatty-acid amide hydrolase 1
Type:Protein
Mol. Mass.:63071.19
Organism:Homo sapiens (Human)
Description:O00519
Residue:579
BDBM50096882
NameBDBM50096882
Synonyms:(5Z,9Z,12Z)-Octadeca-5,9,12-trienoic acid [2-(3,4-dihydroxy-phenyl)-ethyl]-amide | CHEMBL422637
TypeSmall organic molecule
Emp. Form.C26H39NO3
Mol. Mass.413.5928
SMILESCCCCC\C=C/C\C=C/CC\C=C/CCCC(=O)NCCc1ccc(O)c(O)c1