Reaction Details
TargetGenome polyprotein
LigandBDBM50171304
Substrate/Competitorn/a
Meas. Tech.ChEMBL_303746 (CHEMBL829789)
Ki 7800±n/a nM
Citation Venkatraman, SNjoroge, FGGirijavallabhan, VMMadison, VSYao, NHProngay, AJButkiewicz, NPichardo, J Design and synthesis of depeptidized macrocyclic inhibitors of hepatitis C NS3-4A protease using structure-based drug design. J Med Chem48:5088-91 (2005) 
 
Genome polyprotein
Name:Genome polyprotein
Type:Protein
Mol. Mass.:67067.41
Organism:Hepatitis C virus
Description:A3EZI9
Residue:631
BDBM50171304
NameBDBM50171304
Synonyms:(S)-(2-{(S)-3-[((9S,12S,15S)-15-tert-Butoxycarbonylamino-12-cyclohexyl-11,14-dioxo-2-oxa-10,13-diaza-tricyclo[15.2.2.1*3,7*]docosa-1(20),3(22),4,6,17(21),18-hexaene-9-carbonyl)-amino]-2-oxo-hexanoylamino}-acetylamino)-phenyl-acetic acid | CHEMBL365565
TypeSmall organic molecule
Emp. Form.C47H58N6O11
Mol. Mass.882.997
SMILESCCC[C@H](NC(=O)[C@@H]1Cc2cccc(Oc3ccc(C[C@H](NC(=O)OC(C)(C)C)C(=O)N[C@@H](C4CCCCC4)C(=O)N1)cc3)c2)C(=O)C(=O)NCC(=O)N[C@H](C(O)=O)c1ccccc1