Reaction Details
TargetAdenosine deaminase
LigandBDBM50410269
Substrate/Competitorn/a
Meas. Tech.ChEMBL_302877 (CHEMBL828791)
Ki 1±n/a nM
Citation Da Settimo, FPrimofiore, GLa Motta, CTaliani, SSimorini, FMarini, AMMugnaini, LLavecchia, ANovellino, ETuscano, DMartini, C Novel, highly potent adenosine deaminase inhibitors containing the pyrazolo[3,4-d]pyrimidine ring system. Synthesis, structure-activity relationships, and molecular modeling studies. J Med Chem48:5162-74 (2005) 
 
Adenosine deaminase
Name:Adenosine deaminase
Type:Enzyme
Mol. Mass.:40910.44
Organism:Bos taurus (bovine)
Description:n/a
Residue:363
BDBM50410269
NameBDBM50410269
Synonyms:CHEMBL1181766
TypeSmall organic molecule
Emp. Form.C13H21N5O
Mol. Mass.263.3387
SMILESCCCCCCC(O)Cn1cc2c(N)ncnc2n1