Reaction Details
TargetAdenosine deaminase
LigandBDBM50171396
Substrate/Competitorn/a
Meas. Tech.ChEMBL_302877 (CHEMBL828791)
Ki 0.28±n/a nM
Citation Da Settimo, FPrimofiore, GLa Motta, CTaliani, SSimorini, FMarini, AMMugnaini, LLavecchia, ANovellino, ETuscano, DMartini, C Novel, highly potent adenosine deaminase inhibitors containing the pyrazolo[3,4-d]pyrimidine ring system. Synthesis, structure-activity relationships, and molecular modeling studies. J Med Chem48:5162-74 (2005) 
 
Adenosine deaminase
Name:Adenosine deaminase
Type:Enzyme
Mol. Mass.:40910.44
Organism:Bos taurus (bovine)
Description:n/a
Residue:363
BDBM50171396
NameBDBM50171396
Synonyms:1-((R)-4-Amino-pyrazolo[3,4-d]pyrimidin-2-yl)-decan-2-ol | CHEMBL190239
TypeSmall organic molecule
Emp. Form.C15H25N5O
Mol. Mass.291.3919
SMILESCCCCCCCCC(O)Cn1cc2c(N)ncnc2n1