Reaction Details
Target5-hydroxytryptamine receptor 6
LigandBDBM50159192
Substrate/Competitorn/a
Meas. Tech.ChEMBL_310551 (CHEMBL834452)
EC50 2.7±n/a nM
Citation Cole, DCLennox, WJLombardi, SEllingboe, JWBernotas, RCTawa, GJMazandarani, HSmith, DLZhang, GCoupet, JSchechter, LE Discovery of 5-arylsulfonamido-3-(pyrrolidin-2-ylmethyl)-1H-indole derivatives as potent, selective 5-HT6 receptor agonists and antagonists. J Med Chem48:353-6 (2005) 
 
5-hydroxytryptamine receptor 6
Name:5-hydroxytryptamine receptor 6
Type:G Protein-Coupled Receptor (GPCR)
Mol. Mass.:46968.43
Organism:Homo sapiens (Human)
Description:P50406
Residue:440
BDBM50159192
NameBDBM50159192
Synonyms:4-Iodo-N-[3-((R)-1-methyl-pyrrolidin-2-ylmethyl)-1H-indol-5-yl]-benzenesulfonamide
TypeSmall organic molecule
Emp. Form.C20H22IN3O2S
Mol. Mass.495.377
SMILESCN1CCCC1Cc1c[nH]c2ccc(NS(=O)(=O)c3ccc(I)cc3)cc12