Reaction Details
Target5-hydroxytryptamine receptor 6
LigandBDBM50159190
Substrate/Competitorn/a
Meas. Tech.ChEMBL_310551 (CHEMBL834452)
EC50 2.9±n/a nM
Citation Cole, DCLennox, WJLombardi, SEllingboe, JWBernotas, RCTawa, GJMazandarani, HSmith, DLZhang, GCoupet, JSchechter, LE Discovery of 5-arylsulfonamido-3-(pyrrolidin-2-ylmethyl)-1H-indole derivatives as potent, selective 5-HT6 receptor agonists and antagonists. J Med Chem48:353-6 (2005) 
 
5-hydroxytryptamine receptor 6
Name:5-hydroxytryptamine receptor 6
Type:G Protein-Coupled Receptor (GPCR)
Mol. Mass.:46968.43
Organism:Homo sapiens (Human)
Description:P50406
Residue:440
BDBM50159190
NameBDBM50159190
Synonyms:N-[3-((R)-1-Methyl-pyrrolidin-2-ylmethyl)-1H-indol-5-yl]-4-trifluoromethoxy-benzenesulfonamide | N-[3-((S)-1-Methyl-pyrrolidin-2-ylmethyl)-1H-indol-5-yl]-4-trifluoromethoxy-benzenesulfonamide
TypeSmall organic molecule
Emp. Form.C21H22F3N3O3S
Mol. Mass.453.478
SMILESCN1CCCC1Cc1c[nH]c2ccc(NS(=O)(=O)c3ccc(OC(F)(F)F)cc3)cc12