Reaction Details
Target5-hydroxytryptamine receptor 6
LigandBDBM50159188
Substrate/Competitorn/a
Meas. Tech.ChEMBL_303674 (CHEMBL830434)
Ki 34±n/a nM
Citation Cole, DCLennox, WJLombardi, SEllingboe, JWBernotas, RCTawa, GJMazandarani, HSmith, DLZhang, GCoupet, JSchechter, LE Discovery of 5-arylsulfonamido-3-(pyrrolidin-2-ylmethyl)-1H-indole derivatives as potent, selective 5-HT6 receptor agonists and antagonists. J Med Chem48:353-6 (2005) 
 
5-hydroxytryptamine receptor 6
Name:5-hydroxytryptamine receptor 6
Type:G Protein-Coupled Receptor (GPCR)
Mol. Mass.:46968.43
Organism:Homo sapiens (Human)
Description:P50406
Residue:440
BDBM50159188
NameBDBM50159188
Synonyms:4-Methoxy-N-[3-((R)-1-methyl-pyrrolidin-2-ylmethyl)-1H-indol-5-yl]-benzenesulfonamide | 4-Methoxy-N-[3-((S)-1-methyl-pyrrolidin-2-ylmethyl)-1H-indol-5-yl]-benzenesulfonamide
TypeSmall organic molecule
Emp. Form.C21H25N3O3S
Mol. Mass.399.507
SMILESCOc1ccc(cc1)S(=O)(=O)Nc1ccc2[nH]cc(CC3CCCN3C)c2c1