Reaction Details
TargetThymidine phosphorylase
LigandBDBM50122764
Substrate/Competitorn/a
Meas. Tech.ChEMBL_305155 (CHEMBL832607)
IC50 19±n/a nM
Citation Reigan, PEdwards, PNGbaj, ACole, CBarry, STPage, KMAshton, SELuke, RWDouglas, KTStratford, IJJaffar, MBryce, RAFreeman, S Aminoimidazolylmethyluracil analogues as potent inhibitors of thymidine phosphorylase and their bioreductive nitroimidazolyl prodrugs. J Med Chem48:392-402 (2005) 
 
Thymidine phosphorylase
Name:Thymidine phosphorylase
Type:Enzyme
Mol. Mass.:49948.87
Organism:Homo sapiens (Human)
Description:The recombinant human thymidine phosphorylase (V79TP) was expressed in V79 Chinese hamster cells (Sigma, T-9319).
Residue:482
BDBM50122764
NameBDBM50122764
Synonyms:2-Amino-1-(5-bromo-2,6-dioxo-1,2,3,6-tetrahydro-pyrimidin-4-ylmethyl)-3H-imidazol-1-ium; chloride CHEMBL122679 | CHEMBL65986
TypeSmall organic molecule
Emp. Form.C8H9BrN5O2
Mol. Mass.287.093
SMILESNc1[nH+]ccn1Cc1[nH]c(=O)[nH]c(=O)c1Br