Reaction Details
TargetCytochrome P450 2A6
LigandBDBM10758
Substrate/Competitorn/a
Meas. Tech.ChEMBL_305266 (CHEMBL832816)
IC50 4410±n/a nM
Citation Rahnasto, MRaunio, HPoso, AWittekindt, CJuvonen, RO Quantitative structure-activity relationship analysis of inhibitors of the nicotine metabolizing CYP2A6 enzyme. J Med Chem48:440-9 (2005) 
 
Cytochrome P450 2A6
Name:Cytochrome P450 2A6
Type:Protein
Mol. Mass.:56514.34
Organism:Homo sapiens (Human)
Description:P11509
Residue:494
BDBM10758
NameBDBM10758
Synonyms:14C-phenylethylamine CHEMBL610 | phenylethylamine
TypeSmall organic molecule
Emp. Form.C8H11N
Mol. Mass.121.1796
SMILESNCCc1ccccc1