Reaction Details
TargetCytochrome P450 2A5
LigandBDBM10758
Substrate/Competitorn/a
Meas. Tech.ChEMBL_305268 (CHEMBL832818)
IC50 3000±n/a nM
Citation Rahnasto, MRaunio, HPoso, AWittekindt, CJuvonen, RO Quantitative structure-activity relationship analysis of inhibitors of the nicotine metabolizing CYP2A6 enzyme. J Med Chem48:440-9 (2005) 
 
Cytochrome P450 2A5
Name:Cytochrome P450 2A5
Type:PROTEIN
Mol. Mass.:56752.73
Organism:Mus musculus
Description:ChEMBL_572014
Residue:494
BDBM10758
NameBDBM10758
Synonyms:14C-phenylethylamine CHEMBL610 | phenylethylamine
TypeSmall organic molecule
Emp. Form.C8H11N
Mol. Mass.121.1796
SMILESNCCc1ccccc1