Reaction Details
TargetCytochrome P450 2A5
LigandBDBM50159251
Substrate/Competitorn/a
Meas. Tech.ChEMBL_305268 (CHEMBL832818)
IC50 2400±n/a nM
Citation Rahnasto, MRaunio, HPoso, AWittekindt, CJuvonen, RO Quantitative structure-activity relationship analysis of inhibitors of the nicotine metabolizing CYP2A6 enzyme. J Med Chem48:440-9 (2005) 
 
Cytochrome P450 2A5
Name:Cytochrome P450 2A5
Type:PROTEIN
Mol. Mass.:56752.73
Organism:Mus musculus
Description:ChEMBL_572014
Residue:494
BDBM50159251
NameBDBM50159251
Synonyms:1,5-Dichloro-naphthalene CHEMBL195820
TypeSmall organic molecule
Emp. Form.C10H6Cl2
Mol. Mass.197.061
SMILESClc1cccc2c(Cl)cccc12