Reaction Details
TargetCytochrome P450 2A5
LigandBDBM50159265
Substrate/Competitorn/a
Meas. Tech.ChEMBL_305268 (CHEMBL832818)
IC50 4680±n/a nM
Citation Rahnasto, MRaunio, HPoso, AWittekindt, CJuvonen, RO Quantitative structure-activity relationship analysis of inhibitors of the nicotine metabolizing CYP2A6 enzyme. J Med Chem48:440-9 (2005) 
 
Cytochrome P450 2A5
Name:Cytochrome P450 2A5
Type:PROTEIN
Mol. Mass.:56752.73
Organism:Mus musculus
Description:ChEMBL_572014
Residue:494
BDBM50159265
NameBDBM50159265
Synonyms:4-Methylbenzaldehyde CHEMBL190927 Paratolualdehyde p-Toluylaldehyde p-tolualdehyde para-Tolualdehyde | para-Toluyl aldehyde
TypeSmall organic molecule
Emp. Form.C8H8O
Mol. Mass.120.1485
SMILESCc1ccc(C=O)cc1