Reaction Details
TargetNeprilysin
LigandBDBM50159365
Substrate/Competitorn/a
Meas. Tech.ChEMBL_305089 (CHEMBL832394)
IC50>100000±n/a nM
Citation Berger, YDehmlow, HBlum-Kaelin, DKitas, EALöffler, BMAebi, JDJuillerat-Jeanneret, L Endothelin-converting enzyme-1 inhibition and growth of human glioblastoma cells. J Med Chem48:483-98 (2005) 
 
Neprilysin
Name:Neprilysin
Type:Enzyme
Mol. Mass.:85505.38
Organism:Homo sapiens (Human)
Description:P08473
Residue:750
BDBM50159365
NameBDBM50159365
Synonyms:(3R,5S)-5-{[(2,5-difluorobenzyl)amino]methyl}-1-(5-propylpyrimidin-2-yl)pyrrolidine-3-thiol | CHEMBL194651
TypeSmall organic molecule
Emp. Form.C19H24F2N4S
Mol. Mass.378.482
SMILESCCCc1cnc(nc1)N1C[C@H](S)CC1CNCc1cc(F)ccc1F