Reaction Details
TargetEndothelin-converting enzyme 1
LigandBDBM50159367
Substrate/Competitorn/a
Meas. Tech.ChEMBL_305797 (CHEMBL827985)
IC50 49.70±n/a nM
Citation Berger, YDehmlow, HBlum-Kaelin, DKitas, EALöffler, BMAebi, JDJuillerat-Jeanneret, L Endothelin-converting enzyme-1 inhibition and growth of human glioblastoma cells. J Med Chem48:483-98 (2005) 
 
Endothelin-converting enzyme 1
Name:Endothelin-converting enzyme 1
Type:Enzyme
Mol. Mass.:87155.11
Organism:Homo sapiens (Human)
Description:P42892
Residue:770
BDBM50159367
NameBDBM50159367
Synonyms:(2S,4R)-4-Benzoylsulfanyl-2-(2,4,5-trifluoro-benzyloxymethyl)-pyrrolidine-1-carboxylic acid 2,3-dihydro-benzo[1,4]dioxin-5-yl ester | CHEMBL193490
TypeSmall organic molecule
Emp. Form.C28H24F3NO6S
Mol. Mass.559.553
SMILESFc1cc(F)c(COC[C@@H]2C[C@H](CN2C(=O)Oc2cccc3OCCOc23)SC(=O)c2ccccc2)cc1F