Reaction Details
TargetCytidine deaminase
LigandBDBM50367034
Substrate/Competitorn/a
Meas. Tech.ChEMBL_302817 (CHEMBL839507)
Ki 25±n/a nM
Citation Chung, SJFromme, JCVerdine, GL Structure of human cytidine deaminase bound to a potent inhibitor. J Med Chem48:658-60 (2005) 
 
Cytidine deaminase
Name:Cytidine deaminase
Type:Ezyme
Mol. Mass.:16185.04
Organism:Homo sapiens (Human)
Description:P32320
Residue:146
BDBM50367034
NameBDBM50367034
Synonyms:CHEMBL610997
TypeSmall organic molecule
Emp. Form.C10H16N2O5
Mol. Mass.244.2444
SMILESOC[C@H]1OC([C@H](O)[C@@H]1O)N1CC=CCNC1=O