Reaction Details
TargetAmiloride-sensitive amine oxidase [copper-containing]
LigandBDBM50161140
Substrate/Competitorn/a
Meas. Tech.ChEMBL_306517 (CHEMBL828122)
IC50 50000±n/a nM
Citation Bertini, VBuffoni, FIgnesti, GPicci, NTrombino, SIemma, FAlfei, SPocci, MLucchesini, FDe Munno, A Alkylamino derivatives of 4-aminomethylpyridine as inhibitors of copper-containing amine oxidases. J Med Chem48:664-70 (2005) 
 
Amiloride-sensitive amine oxidase [copper-containing]
Name:Amiloride-sensitive amine oxidase [copper-containing]
Type:Protein
Mol. Mass.:85387.64
Organism:Homo sapiens (Human)
Description:P19801
Residue:751
BDBM50161140
NameBDBM50161140
Synonyms:4-(aminomethyl)-N-(cyclohexylmethyl)pyridin-3-amine dihydrochloride hydrate | CHEMBL541126
TypeSmall organic molecule
Emp. Form.C13H21N3
Mol. Mass.219.3259
SMILESNCc1ccncc1NCC1CCCCC1