Reaction Details
TargetAmiloride-sensitive amine oxidase [copper-containing]
LigandBDBM50161137
Substrate/Competitorn/a
Meas. Tech.ChEMBL_306517 (CHEMBL828122)
IC50>100000±n/a nM
Citation Bertini, VBuffoni, FIgnesti, GPicci, NTrombino, SIemma, FAlfei, SPocci, MLucchesini, FDe Munno, A Alkylamino derivatives of 4-aminomethylpyridine as inhibitors of copper-containing amine oxidases. J Med Chem48:664-70 (2005) 
 
Amiloride-sensitive amine oxidase [copper-containing]
Name:Amiloride-sensitive amine oxidase [copper-containing]
Type:Protein
Mol. Mass.:85387.64
Organism:Homo sapiens (Human)
Description:P19801
Residue:751
BDBM50161137
NameBDBM50161137
Synonyms:CHEMBL536949 | N-[2-(aminomethyl)phenyl]-N-methylamine dihydrochloride
TypeSmall organic molecule
Emp. Form.C8H12N2
Mol. Mass.136.1943
SMILESCNc1ccccc1CN