Reaction Details
TargetAmiloride-sensitive amine oxidase [copper-containing]
LigandBDBM50161149
Substrate/Competitorn/a
Meas. Tech.ChEMBL_306517 (CHEMBL828122)
IC50 1000±n/a nM
Citation Bertini, VBuffoni, FIgnesti, GPicci, NTrombino, SIemma, FAlfei, SPocci, MLucchesini, FDe Munno, A Alkylamino derivatives of 4-aminomethylpyridine as inhibitors of copper-containing amine oxidases. J Med Chem48:664-70 (2005) 
 
Amiloride-sensitive amine oxidase [copper-containing]
Name:Amiloride-sensitive amine oxidase [copper-containing]
Type:Protein
Mol. Mass.:85387.64
Organism:Homo sapiens (Human)
Description:P19801
Residue:751
BDBM50161149
NameBDBM50161149
Synonyms:4-(aminomethyl)-N-isopropyl-5-[isopropyl(methyl)-lambda~5~-azanyl]pyridin-3-amine dihydrochloride | CHEMBL537405
TypeSmall organic molecule
Emp. Form.C13H24N4
Mol. Mass.236.3565
SMILESCC(C)Nc1cncc(N(C)C(C)C)c1CN