Reaction Details
TargetAmiloride-sensitive amine oxidase [copper-containing]
LigandBDBM50161147
Substrate/Competitorn/a
Meas. Tech.ChEMBL_306517 (CHEMBL828122)
IC50 5000±n/a nM
Citation Bertini, VBuffoni, FIgnesti, GPicci, NTrombino, SIemma, FAlfei, SPocci, MLucchesini, FDe Munno, A Alkylamino derivatives of 4-aminomethylpyridine as inhibitors of copper-containing amine oxidases. J Med Chem48:664-70 (2005) 
 
Amiloride-sensitive amine oxidase [copper-containing]
Name:Amiloride-sensitive amine oxidase [copper-containing]
Type:Protein
Mol. Mass.:85387.64
Organism:Homo sapiens (Human)
Description:P19801
Residue:751
BDBM50161147
NameBDBM50161147
Synonyms:4-(aminomethyl)-N-cyclopropylpyridin-3-amine dihydrochloride hydrate | CHEMBL537174
TypeSmall organic molecule
Emp. Form.C9H13N3
Mol. Mass.163.2196
SMILESNCc1ccncc1NC1CC1