Reaction Details
TargetEpidermal growth factor receptor
LigandBDBM50161899
Substrate/Competitorn/a
Meas. Tech.ChEMBL_312997 (CHEMBL873338)
IC50 32±n/a nM
Citation Tsou, HROverbeek-Klumpers, EGHallett, WAReich, MFFloyd, MBJohnson, BDMichalak, RSNilakantan, RDiscafani, CGolas, JRabindran, SKShen, RShi, XWang, YFUpeslacis, JWissner, A Optimization of 6,7-disubstituted-4-(arylamino)quinoline-3-carbonitriles as orally active, irreversible inhibitors of human epidermal growth factor receptor-2 kinase activity. J Med Chem48:1107-31 (2005) 
 
Epidermal growth factor receptor
Name:Epidermal growth factor receptor
Type:Receptor Kinase Domain
Mol. Mass.:134279.59
Organism:Homo sapiens (Human)
Description:P00533
Residue:1210
BDBM50161899
NameBDBM50161899
Synonyms:4-Dimethylamino-but-2-enoic acid {4-[3-chloro-4-(5-phenyl-thiazol-2-ylsulfanyl)-phenylamino]-3-cyano-7-methoxy-quinolin-6-yl}-amide N-(4-(3-chloro-4-(5-phenylthiazol-2-ylthio)phenylamino)-3-cyano-7-methoxyquinolin-6-yl)-4-(dimethylamino)but-2-enamide
TypeSmall organic molecule
Emp. Form.C32H27ClN6O2S2
Mol. Mass.627.179
SMILESCOc1cc2ncc(C#N)c(Nc3ccc(Sc4ncc(s4)-c4ccccc4)c(Cl)c3)c2cc1NC(=O)\C=C\CN(C)C