Reaction Details
TargetEpidermal growth factor receptor
LigandBDBM50161936
Substrate/Competitorn/a
Meas. Tech.ChEMBL_312997 (CHEMBL873338)
IC50 26±n/a nM
Citation Tsou, HROverbeek-Klumpers, EGHallett, WAReich, MFFloyd, MBJohnson, BDMichalak, RSNilakantan, RDiscafani, CGolas, JRabindran, SKShen, RShi, XWang, YFUpeslacis, JWissner, A Optimization of 6,7-disubstituted-4-(arylamino)quinoline-3-carbonitriles as orally active, irreversible inhibitors of human epidermal growth factor receptor-2 kinase activity. J Med Chem48:1107-31 (2005) 
 
Epidermal growth factor receptor
Name:Epidermal growth factor receptor
Type:Receptor Kinase Domain
Mol. Mass.:134279.59
Organism:Homo sapiens (Human)
Description:P00533
Residue:1210
BDBM50161936
NameBDBM50161936
Synonyms:4-Azetidin-1-yl-but-2-enoic acid [4-(4-benzyloxy-3-chloro-phenylamino)-3-cyano-7-ethoxy-quinolin-6-yl]-amide | CHEMBL368702
TypeSmall organic molecule
Emp. Form.C32H30ClN5O3
Mol. Mass.568.065
SMILESCCOc1cc2ncc(C#N)c(Nc3ccc(OCc4ccccc4)c(Cl)c3)c2cc1NC(=O)\C=C\CN1CCC1